BDBM50344132 CHEMBL1778104::N-(6-(2,4-difluorophenoxy)-1H-pyrazolo[3,4-d]pyrimidin-3-yl)ethanesulfonamide
SMILES CCS(=O)(=O)Nc1[nH]nc2nc(Oc3ccc(F)cc3F)ncc12
InChI Key InChIKey=PZUCDXDZRRTQPH-UHFFFAOYSA-N
Data  1 IC50
  Tab Delimited (TSV)   2D SDfile   Computed 3D by Vconf -m prep SDfile
Find this compound or compounds like it in BindingDB:
Activity Spreadsheet -- Enzyme Inhibition Constant Data from BindingDB
Found 1 hit for monomerid = 50344132
TargetMitogen-activated protein kinase 14(Homo sapiens (Human))
Roche Palo Alto
Curated by ChEMBL
LigandPNGBDBM50344132(CHEMBL1778104 | N-(6-(2,4-difluorophenoxy)-1H-pyra...)
Affinity DataIC50:  3.58E+3nM. Assay description: Inhibition of p38alpha assessed as [33P]gamma-ATP incorporation into myelin basic protein
In DepthDetails ArticlePubMed