BDBM50344237 CHEMBL1778870::N-((6-(4-fluoro-2-methoxyphenyl)pyrazin-2-yl)methyl)ethanamine
SMILES CCNCc1cncc(n1)-c1ccc(F)cc1OC
InChI Key InChIKey=WPBRGSPFSJGKNQ-UHFFFAOYSA-N
Data  1 KI
  Tab Delimited (TSV)   2D SDfile   Computed 3D by Vconf -m prep SDfile
Find this compound or compounds like it in BindingDB:
Activity Spreadsheet -- Enzyme Inhibition Constant Data from BindingDB
Found 1 hit for monomerid = 50344237
TargetGlutamate receptor ionotropic, NMDA 2B(Rattus norvegicus (Rat))
Astrazeneca Pharmaceuticals
Curated by ChEMBL
LigandPNGBDBM50344237(CHEMBL1778870 | N-((6-(4-fluoro-2-methoxyphenyl)py...)
Affinity DataKi:  255nM. Assay description: Displacement of [3H]CP101606 from NR2B in rat brain minus cerebellum membrane
In DepthDetails ArticlePubMed