BDBM50344274 (R)-quinuclidin-3-yl pentyl(phenyl)carbamate::CHEMBL1779037
SMILES CCCCCN(C(=O)O[C@H]1CN2CCC1CC2)c1ccccc1
InChI Key InChIKey=SRSDGJOKLMADHL-SFHVURJKSA-N
Data  3 IC50
  Tab Delimited (TSV)   2D SDfile   Computed 3D by Vconf -m prep SDfile
Find this compound or compounds like it in BindingDB:
Activity Spreadsheet -- Enzyme Inhibition Constant Data from BindingDB
Found 3 hits for monomerid = 50344274
TargetMuscarinic acetylcholine receptor M1(Homo sapiens (Human))
RhôNe-Poulenc Rorer
Curated by ChEMBL
LigandPNGBDBM50344274((R)-quinuclidin-3-yl pentyl(phenyl)carbamate | CHE...)
Affinity DataIC50:  0.800nM. Assay description: Displacement of [3H]NMS from human muscarinic M1 receptor expressed in CHO-K1 cells after 1 hr by scintillation counting
In DepthDetails ArticlePubMed
TargetMuscarinic acetylcholine receptor M2(Homo sapiens (Human))
RhôNe-Poulenc Rorer
Curated by ChEMBL
LigandPNGBDBM50344274((R)-quinuclidin-3-yl pentyl(phenyl)carbamate | CHE...)
Affinity DataIC50:  13.6nM. Assay description: Displacement of [3H]NMS from human muscarinic M2 receptor expressed in CHO-K1 cells after 1 hr by scintillation counting
In DepthDetails ArticlePubMed
TargetMuscarinic acetylcholine receptor M3(Homo sapiens (Human))
RhôNe-Poulenc Rorer
Curated by ChEMBL
LigandPNGBDBM50344274((R)-quinuclidin-3-yl pentyl(phenyl)carbamate | CHE...)
Affinity DataIC50:  1.70nM. Assay description: Displacement of [3H]NMS from human muscarinic M3 receptor expressed in CHO-K1 cells after 1 hr by scintillation counting
In DepthDetails ArticlePubMed