BDBM50344444 3-amino-4-(4-(benzyloxy)-3-methoxyphenyl)-N-(5-chloro-2-methoxyphenyl)-6-phenylthieno[2,3-b]pyridine-2-carboxamide::CHEMBL1780012
SMILES COc1ccc(Cl)cc1NC(=O)c1sc2nc(cc(-c3ccc(OCc4ccccc4)c(OC)c3)c2c1N)-c1ccccc1
InChI Key InChIKey=CZTBWPVEKYFNNC-UHFFFAOYSA-N
Data  1 KI  1 IC50
  Tab Delimited (TSV)   2D SDfile   Computed 3D by Vconf -m prep SDfile
Find this compound or compounds like it in BindingDB:
Activity Spreadsheet -- Enzyme Inhibition Constant Data from BindingDB
Found 2 hits for monomerid = 50344444
TargetPlasmepsin II(Plasmodium falciparum)
Trinity College
Curated by ChEMBL
LigandPNGBDBM50344444(3-amino-4-(4-(benzyloxy)-3-methoxyphenyl)-N-(5-chl...)
Affinity DataKi:  1.60E+3nM. Assay description: Inhibition of Plasmodium falciparum plasmepsin 2 using DABCYL-Glu-Arg-Nle-Phe-Leu- Ser-Phe-Pro-EDANS fluorogenic substrate by fluorogenic assay
In DepthDetails ArticlePubMed
TargetPlasmepsin II(Plasmodium falciparum)
Trinity College
Curated by ChEMBL
LigandPNGBDBM50344444(3-amino-4-(4-(benzyloxy)-3-methoxyphenyl)-N-(5-chl...)
Affinity DataIC50:  2.30E+3nM. Assay description: Inhibition of Plasmodium falciparum plasmepsin 2 using DABCYL-Glu-Arg-Nle-Phe-Leu- Ser-Phe-Pro-EDANS fluorogenic substrate by fluorogenic assay
In DepthDetails ArticlePubMed