BDBM50344546 4-(2-(2-chlorophenylamino)benzo[d]oxazol-5-yloxy)-N-methylpicolinamide::CHEMBL1778293
SMILES CNC(=O)c1cc(Oc2ccc3oc(Nc4ccccc4Cl)nc3c2)ccn1
InChI Key InChIKey=NOGSYGYUFQNRTN-UHFFFAOYSA-N
Data  1 IC50
  Tab Delimited (TSV)   2D SDfile   Computed 3D by Vconf -m prep SDfile
Find this compound or compounds like it in BindingDB:
Activity Spreadsheet -- Enzyme Inhibition Constant Data from BindingDB
Found 1 hit for monomerid = 50344546
TargetRAF proto-oncogene serine/threonine-protein kinase(Homo sapiens (Human))
Novartis Institutes For Biomedical Research
Curated by ChEMBL
LigandPNGBDBM50344546(4-(2-(2-chlorophenylamino)benzo[d]oxazol-5-yloxy)-...)
Affinity DataIC50:  120nM. Assay description: Inhibition of c-Raf assessed as phosphorylation of MEK1/2 by ELISA
In DepthDetails ArticlePubMed