BDBM50344614 CHEMBL1778905::Ethyl-(E)-4-(4-(3-(5-bromo-4-hydroxy-2-methoxyphenyl)acryloyl)phenoxy)butanoate
SMILES CCOC(=O)CCCOc1ccc(cc1)C(=O)\C=C\c1cc(Br)c(O)cc1OC
InChI Key InChIKey=YZGHFVCJYIWMEB-DHZHZOJOSA-N
Data  1 IC50
  Tab Delimited (TSV)   2D SDfile   Computed 3D by Vconf -m prep SDfile
Find this compound or compounds like it in BindingDB:
Activity Spreadsheet -- Enzyme Inhibition Constant Data from BindingDB
Found 1 hit for monomerid = 50344614
TargetTyrosine-protein phosphatase non-receptor type 1(Homo sapiens (Human))
Chonnam National University
Curated by ChEMBL
LigandPNGBDBM50344614(CHEMBL1778905 | Ethyl-(E)-4-(4-(3-(5-bromo-4-hydro...)
Affinity DataIC50:  1.08E+4nM. Assay description: Inhibition of recombinant human PTP1B using p-nitrophenyl phosphate as substrate after 30 mins
In DepthDetails ArticlePubMed