BDBM50344620 (E)-3-(5-Bromo-4-hydroxy-2-methoxyphenyl)-1-(4-methoxyphenyl)prop-2-en-1-one::CHEMBL1778899
SMILES COc1ccc(cc1)C(=O)\C=C\c1cc(Br)c(O)cc1OC
InChI Key InChIKey=JZJREZZAJGJQIN-VMPITWQZSA-N
Data  1 IC50
  Tab Delimited (TSV)   2D SDfile   Computed 3D by Vconf -m prep SDfile
Find this compound or compounds like it in BindingDB:
Activity Spreadsheet -- Enzyme Inhibition Constant Data from BindingDB
Found 1 hit for monomerid = 50344620
TargetTyrosine-protein phosphatase non-receptor type 1(Homo sapiens (Human))
Chonnam National University
Curated by ChEMBL
LigandPNGBDBM50344620((E)-3-(5-Bromo-4-hydroxy-2-methoxyphenyl)-1-(4-met...)
Affinity DataIC50:  9.90E+3nM. Assay description: Inhibition of recombinant human PTP1B using p-nitrophenyl phosphate as substrate after 30 mins
In DepthDetails ArticlePubMed