BDBM50344766 (R)-4-(3-amino-4-(2,4,5-trifluorophenyl)butanoyl)-1-(2-morpholinoethyl)piperazin-2-one::CHEMBL1779692
SMILES N[C@@H](CC(=O)N1CCN(CCN2CCOCC2)C(=O)C1)Cc1cc(F)c(F)cc1F
InChI Key InChIKey=ZQKSWJKBDAUHHU-OAHLLOKOSA-N
Data  1 IC50
  Tab Delimited (TSV)   2D SDfile   Computed 3D by Vconf -m prep SDfile
Find this compound or compounds like it in BindingDB:
Activity Spreadsheet -- Enzyme Inhibition Constant Data from BindingDB
Found 1 hit for monomerid = 50344766
TargetDipeptidyl peptidase 4(Homo sapiens (Human))
Dong-A Pharm.
Curated by ChEMBL
LigandPNGBDBM50344766((R)-4-(3-amino-4-(2,4,5-trifluorophenyl)butanoyl)-...)
Affinity DataIC50:  116nM. Assay description: Inhibition of recombinant human DPP-4 assessed as H-Gly-Pro-AMC cleavage after 1 hr by fluorescence assay
In DepthDetails ArticlePubMed