BDBM50344999 2-(2'-chloro-4'-(N-methylmethylsulfonamido)-5-(trifluoromethyl)biphenyl-2-yloxy)acetic acid::CHEMBL1778632
SMILES CN(c1ccc(c(Cl)c1)-c1cc(ccc1OCC(O)=O)C(F)(F)F)S(C)(=O)=O
InChI Key InChIKey=USPKBVJAPGRDPR-UHFFFAOYSA-N
Data  1 IC50
  Tab Delimited (TSV)   2D SDfile   Computed 3D by Vconf -m prep SDfile
Find this compound or compounds like it in BindingDB:
Activity Spreadsheet -- Enzyme Inhibition Constant Data from BindingDB
Found 1 hit for monomerid = 50344999
TargetProstaglandin D2 receptor 2(Homo sapiens (Human))
Astrazeneca R&D Charnwood
Curated by ChEMBL
LigandPNGBDBM50344999(2-(2'-chloro-4'-(N-methylmethylsulfonamido)-5-(tri...)
Affinity DataIC50:  0.100nM. Assay description: Displacement of [3H]-PGD2 from CRTh2 receptor by scintillation proximity assay
In DepthDetails ArticlePubMed