BDBM50345023 (2R,3S,4R,5R,6S)-2-Hydroxymethyl-6-(16-oxa-tricyclo[15.2.2.0*3,8*]henicosa-1(20),3(8),4,6,17(21),18-hexaen-5-yl)-tetrahydro-pyran-3,4,5-triol::CHEMBL1778795
SMILES OC[C@H]1O[C@H]([C@H](O)[C@@H](O)[C@@H]1O)c1ccc2CCCCCCCOc3ccc(Cc2c1)cc3
InChI Key InChIKey=YKHRSVIIDZBCNT-RTJMFUJLSA-N
Data  1 IC50
  Tab Delimited (TSV)   2D SDfile   Computed 3D by Vconf -m prep SDfile
Find this compound or compounds like it in BindingDB:
Activity Spreadsheet -- Enzyme Inhibition Constant Data from BindingDB
Found 1 hit for monomerid = 50345023
TargetSolute carrier family 5 member 4(Homo sapiens (Human))
Green Cross
Curated by ChEMBL
LigandPNGBDBM50345023((2R,3S,4R,5R,6S)-2-Hydroxymethyl-6-(16-oxa-tricycl...)
Affinity DataIC50:  99.7nM. Assay description: Inhibition of human SGLT2 expressed in CHO cells using methyl-alpha-D-glucopyranoside by liquid scintillation counting
In DepthDetails ArticlePubMed