BDBM50345024 (R)-(4-(dodecyloxy)-1-(hydroxymethyl)-3-oxo-1,3-dihydroisobenzofuran-1-yl)methyl 2-tert-butyl-3,3-dimethylbutanoate::CHEMBL1778819
SMILES CCCCCCCCCCCCOc1cccc2c1C(=O)O[C@]2(CO)COC(=O)C(C(C)(C)C)C(C)(C)C
InChI Key InChIKey=HUIBVENWUOGSCC-JGCGQSQUSA-N
Data  1 KI
  Tab Delimited (TSV)   2D SDfile   Computed 3D by Vconf -m prep SDfile
Find this compound or compounds like it in BindingDB:
Activity Spreadsheet -- Enzyme Inhibition Constant Data from BindingDB
Found 1 hit for monomerid = 50345024
TargetProtein kinase C alpha type(Homo sapiens (Human))
Riken Advanced Science Institute
Curated by ChEMBL
LigandPNGBDBM50345024((R)-(4-(dodecyloxy)-1-(hydroxymethyl)-3-oxo-1,3-di...)
Affinity DataKi:  43nM. Assay description: Displacement of [3H]PDBu from human recombinant PKCalpha after 20 mins by liquid scintillation counting
In DepthDetails ArticlePubMed