BDBM50345174 CHEMBL1779741::N-((1H-Indol-3-yl)(3-methoxyphenyl)methyl)-N-methylbenzenamine
SMILES COc1cccc(c1)C(N(C)c1ccccc1)c1c[nH]c2ccccc12
InChI Key InChIKey=AKYFNSVXHCHDLU-UHFFFAOYSA-N
Data  1 IC50
  Tab Delimited (TSV)   2D SDfile   Computed 3D by Vconf -m prep SDfile
Find this compound or compounds like it in BindingDB:
Activity Spreadsheet -- Enzyme Inhibition Constant Data from BindingDB
Found 1 hit for monomerid = 50345174
TargetProto-oncogene tyrosine-protein kinase Src(Homo sapiens (Human))
India Institute Of Technology And Science
Curated by ChEMBL
LigandPNGBDBM50345174(CHEMBL1779741 | N-((1H-Indol-3-yl)(3-methoxyphenyl...)
Affinity DataIC50: >1.50E+5nM. Assay description: Inhibition of c-Src using AEEEIYGEFEAKKKK substrate by fluorescence intensity assay
In DepthDetails ArticlePubMed