BDBM50345204 CHEMBL1783240::N1-(4-Methoxybenzyl)-N8-(1,2,3,4-tetrahydroacridin-9-yl)octane-1,8-diamine
SMILES COc1ccc(CNCCCCCCCCNc2c3CCCCc3nc3ccccc23)cc1
InChI Key InChIKey=GIOQDSMKIHQZEY-UHFFFAOYSA-N
Data  2 IC50
  Tab Delimited (TSV)   2D SDfile   Computed 3D by Vconf -m prep SDfile
Find this compound or compounds like it in BindingDB:
Activity Spreadsheet -- Enzyme Inhibition Constant Data from BindingDB
Found 2 hits for monomerid = 50345204
TargetCholinesterase(Equus caballus (Horse))
Sun Yat-Sen University
Curated by ChEMBL
LigandPNGBDBM50345204(CHEMBL1783240 | N1-(4-Methoxybenzyl)-N8-(1,2,3,4-t...)
Affinity DataIC50:  4.82nM. Assay description: Inhibition of equine serum BuChE assessed as inhibition of butylthiocholine chloride substrate hydrolysis incubated for 15 mins before substrate addi...
In DepthDetails ArticlePubMed
TargetAcetylcholinesterase(Electrophorus electricus (Electric eel))
Sun Yat-Sen University
Curated by ChEMBL
LigandPNGBDBM50345204(CHEMBL1783240 | N1-(4-Methoxybenzyl)-N8-(1,2,3,4-t...)
Affinity DataIC50:  15.3nM. Assay description: Inhibition of electric eel AChE assessed as inhibition of acetylthiocholine chloride substrate hydrolysis incubated for 15 mins before substrate addi...
In DepthDetails ArticlePubMed