BDBM50345206 CHEMBL1783242::N1-(Pyridin-4-ylmethyl)-N8-(1,2,3,4-tetrahydroacridin-9-yl)octane-1,8-diamine
SMILES C(CCCCNc1c2CCCCc2nc2ccccc12)CCCNCc1ccncc1
InChI Key InChIKey=AHEFUMNZCIRKDC-UHFFFAOYSA-N
Data  2 IC50
  Tab Delimited (TSV)   2D SDfile   Computed 3D by Vconf -m prep SDfile
Find this compound or compounds like it in BindingDB:
Activity Spreadsheet -- Enzyme Inhibition Constant Data from BindingDB
Found 2 hits for monomerid = 50345206
TargetCholinesterase(Equus caballus (Horse))
Sun Yat-Sen University
Curated by ChEMBL
LigandPNGBDBM50345206(CHEMBL1783242 | N1-(Pyridin-4-ylmethyl)-N8-(1,2,3,...)
Affinity DataIC50:  4.66nM. Assay description: Inhibition of equine serum BuChE assessed as inhibition of butylthiocholine chloride substrate hydrolysis incubated for 15 mins before substrate addi...
In DepthDetails ArticlePubMed
TargetAcetylcholinesterase(Electrophorus electricus (Electric eel))
Sun Yat-Sen University
Curated by ChEMBL
LigandPNGBDBM50345206(CHEMBL1783242 | N1-(Pyridin-4-ylmethyl)-N8-(1,2,3,...)
Affinity DataIC50:  4.70nM. Assay description: Inhibition of electric eel AChE assessed as inhibition of acetylthiocholine chloride substrate hydrolysis incubated for 15 mins before substrate addi...
In DepthDetails ArticlePubMed