BDBM50345475 CHEMBL4175704
SMILES Fc1ccc(cc1)S(=O)(=O)Nc1ccccc1NS(=O)(=O)c1ccc(Cl)cc1
InChI Key InChIKey=BMCWSRYOAAOTHK-UHFFFAOYSA-N
Data  1 IC50
  Tab Delimited (TSV)   2D SDfile   Computed 3D by Vconf -m prep SDfile
Find this compound or compounds like it in BindingDB:
Activity Spreadsheet -- Enzyme Inhibition Constant Data from BindingDB
Found 1 hit for monomerid = 50345475
TargetProtein lin-28 homolog A(Mus musculus)
University Of Michigan
Curated by ChEMBL
LigandPNGBDBM50345475(CHEMBL4175704)
Affinity DataIC50:  2.73E+4nM. Assay description: Binding affinity to mouse N-terminal Halo-fused/biotin-labelled Lin28A expressed in Escherichia coli BL21(DE3) assessed as inhibition of protein inte...
In DepthDetails ArticlePubMed