BDBM50345586 CHEMBL1784635::N,1-dimethyl-5-((2-methyl-5-(4-((4-methylpiperazin-1-yl)methyl)-3-(trifluoromethyl)phenylcarbamoyl)phenyl)ethynyl)-1H-imidazole-2-carboxamide
SMILES CNC(=O)c1ncc(C#Cc2cc(ccc2C)C(=O)Nc2ccc(CN3CCN(C)CC3)c(c2)C(F)(F)F)n1C
InChI Key InChIKey=NLILIZRMANYJEU-UHFFFAOYSA-N
Data  1 IC50
  Tab Delimited (TSV)   2D SDfile   Computed 3D by Vconf -m prep SDfile
Find this compound or compounds like it in BindingDB:
Activity Spreadsheet -- Enzyme Inhibition Constant Data from BindingDB
Found 1 hit for monomerid = 50345586
TargetTyrosine-protein kinase ABL1(Homo sapiens (Human))
Ariad Pharmaceuticals
Curated by ChEMBL
LigandPNGBDBM50345586(CHEMBL1784635 | N,1-dimethyl-5-((2-methyl-5-(4-((4...)
Affinity DataIC50:  17nM. Assay description: Inhibition of wild type human ABL using [EAIYAAPFAKKK] peptide substrate by Hotspot assay
In DepthDetails ArticlePubMed