BDBM50345631 (S)-2-acetamido-3-((S)-2-((2S,3S)-1-((S)-1-amino-1-oxo-3-phenylpropan-2-ylamino)-3-methyl-1-oxopentan-2-ylcarbamoyl)pyrrolidin-1-yl)-3-oxopropyl dihydrogen phosphate::CHEMBL1784776
SMILES CC[C@H](C)[C@H](NC(=O)[C@@H]1CCCN1C(=O)[C@H](COP(O)(O)=O)NC(C)=O)C(=O)N[C@@H](Cc1ccccc1)C(N)=O
InChI Key InChIKey=YGQLHBBLHAXKIS-JMMIECQRSA-N
Data  1 IC50
  Tab Delimited (TSV)   2D SDfile   Computed 3D by Vconf -m prep SDfile
Find this compound or compounds like it in BindingDB:
Activity Spreadsheet -- Enzyme Inhibition Constant Data from BindingDB
Found 1 hit for monomerid = 50345631
TargetBreast cancer type 1 susceptibility protein(Homo sapiens (Human))
University Of Nebraska Medical Center
Curated by ChEMBL
LigandPNGBDBM50345631((S)-2-acetamido-3-((S)-2-((2S,3S)-1-((S)-1-amino-1...)
Affinity DataIC50:  7.10E+3nM. Assay description: Inhibition of BRCA1 by fluorescence polarization assay
In DepthDetails ArticlePubMed