BDBM50346055 8-methyl-2-(1-methylpiperidin-4-yl)-5-(2-(pyridin-2-yl)ethyl)-2,3,4,5-tetrahydro-1H-pyrido[4,3-b]indole::CHEMBL1783973
SMILES CN1CCC(CC1)N1CCc2c(C1)c1cc(C)ccc1n2CCc1ccccn1
InChI Key InChIKey=ZVMAXLHJDKBSDN-UHFFFAOYSA-N
Data  1 IC50
  Tab Delimited (TSV)   2D SDfile   Computed 3D by Vconf -m prep SDfile
Find this compound or compounds like it in BindingDB:
Activity Spreadsheet -- Enzyme Inhibition Constant Data from BindingDB
Found 1 hit for monomerid = 50346055
TargetHistamine H1 receptor(Homo sapiens (Human))
Chemical Diversity Research Institute
Curated by ChEMBL
LigandPNGBDBM50346055(8-methyl-2-(1-methylpiperidin-4-yl)-5-(2-(pyridin-...)
Affinity DataIC50: >1.00E+4nM. Assay description: Antagonist activity at human histamine H1 receptor in SK-N-SH cells assessed as inhibition of histamine-induced calcium level increase during phase-1...
In DepthDetails ArticlePubMed