BDBM50346096 4-(5-cyano-6-methyl-2-phenylpyrimidin-4-ylamino)benzoic acid::CHEMBL1784114
SMILES Cc1nc(nc(Nc2ccc(cc2)C(O)=O)c1C#N)-c1ccccc1
InChI Key InChIKey=PJSVJDQGNHCINK-UHFFFAOYSA-N
Data  2 IC50
  Tab Delimited (TSV)   2D SDfile   Computed 3D by Vconf -m prep SDfile
Find this compound or compounds like it in BindingDB:
Activity Spreadsheet -- Enzyme Inhibition Constant Data from BindingDB
Found 2 hits for monomerid = 50346096
TargetcAMP-specific 3',5'-cyclic phosphodiesterase 4D(Homo sapiens (Human))
Asahi Kasei Pharma
Curated by ChEMBL
LigandPNGBDBM50346096(4-(5-cyano-6-methyl-2-phenylpyrimidin-4-ylamino)be...)
Affinity DataIC50:  1.50E+3nM. Assay description: Inhibition of human PDE4D3 incubated for 10 mins using cAMP and [3H]cAMP substrates
In DepthDetails ArticlePubMed
TargetcAMP-specific 3',5'-cyclic phosphodiesterase 4B(Homo sapiens (Human))
Asahi Kasei Pharma
Curated by ChEMBL
LigandPNGBDBM50346096(4-(5-cyano-6-methyl-2-phenylpyrimidin-4-ylamino)be...)
Affinity DataIC50:  120nM. Assay description: Inhibition of human PDE4B1 incubated for 10 mins using cAMP and [3H]cAMP substrates
In DepthDetails ArticlePubMed