BDBM50346199 (4-Isopropyl-piperazin-1-yl)-(5-piperidin-1-ylmethylpyrazin-2-yl)-methanone::CHEMBL1783891
SMILES CC(C)N1CCN(CC1)C(=O)c1cnc(CN2CCCCC2)cn1
InChI Key InChIKey=USOUXPUSQBUUOL-UHFFFAOYSA-N
Data  1 KI
  Tab Delimited (TSV)   2D SDfile   Computed 3D by Vconf -m prep SDfile
Find this compound or compounds like it in BindingDB:
Activity Spreadsheet -- Enzyme Inhibition Constant Data from BindingDB
Found 1 hit for monomerid = 50346199
TargetHistamine H3 receptor(Homo sapiens (Human))
Johnson & Johnson Pharmaceutical Research And Development
Curated by ChEMBL
LigandPNGBDBM50346199((4-Isopropyl-piperazin-1-yl)-(5-piperidin-1-ylmeth...)
Affinity DataKi:  1.10nM. Assay description: Displacement of [3H]N-alpha-methylhistamine from human histamine H3 receptor expressed in SK-N-MC cells
In DepthDetails ArticlePubMed