BDBM50346207 2-Piperdin-1-ylmethyl-5-(3-piperdin-1-yl-propoxy)-pyridine::CHEMBL1783895
SMILES C(COc1ccc(CN2CCCCC2)nc1)CN1CCCCC1
InChI Key InChIKey=WKWXSSAQMKWZEO-UHFFFAOYSA-N
Data  1 KI
  Tab Delimited (TSV)   2D SDfile   Computed 3D by Vconf -m prep SDfile
Find this compound or compounds like it in BindingDB:
Activity Spreadsheet -- Enzyme Inhibition Constant Data from BindingDB
Found 1 hit for monomerid = 50346207
TargetHistamine H3 receptor(Homo sapiens (Human))
Johnson & Johnson Pharmaceutical Research And Development
Curated by ChEMBL
LigandPNGBDBM50346207(2-Piperdin-1-ylmethyl-5-(3-piperdin-1-yl-propoxy)-...)
Affinity DataKi:  0.900nM. Assay description: Displacement of [3H]N-alpha-methylhistamine from human histamine H3 receptor expressed in SK-N-MC cells
In DepthDetails ArticlePubMed