BDBM50346426 10-(((1S,9aR)-octahydro-1H-quinolizin-1-yl)methyl)-2-(trifluoromethyl)-10H-phenothiazine::CHEMBL1782710
SMILES FC(F)(F)c1ccc2Sc3ccccc3N(C[C@@H]3CCCN4CCCC[C@H]34)c2c1
InChI Key InChIKey=MRPBCSPHOZQBHD-FUHWJXTLSA-N
Data  1 IC50
  Tab Delimited (TSV)   2D SDfile   Computed 3D by Vconf -m prep SDfile
Find this compound or compounds like it in BindingDB:
Activity Spreadsheet -- Enzyme Inhibition Constant Data from BindingDB
Found 1 hit for monomerid = 50346426
TargetCholinesterase(Equus caballus (Horse))
Universit£
Curated by ChEMBL
LigandPNGBDBM50346426(10-(((1S,9aR)-octahydro-1H-quinolizin-1-yl)methyl)...)
Affinity DataIC50:  4.00E+3nM. Assay description: Inhibition of Equine serum BChE using butyrylthiocoline iodide as a substrate after 20 mins by Ellman's assay
In DepthDetails ArticlePubMed