BDBM50346686 Benzyl 3b-[2-(4-dodecanoyloxymethyl-1H-1,2,3- triazol-1-yl)acetoxy]olean-12-en-28-oate (Compound 7c)::CHEMBL1796876
SMILES CCCCCCCCCCCC(=O)OCc1cn(CC(=O)O[C@H]2CC[C@@]3(C)[C@@H](CC[C@]4(C)[C@@H]3CC=C3[C@@H]5CC(C)(C)CC[C@@]5(CC[C@@]43C)C(=O)OCc3ccccc3)C2(C)C)nn1
InChI Key InChIKey=WCRPZHBOXZPDQB-VNBBYRLQSA-N
Data  2 IC50
  Tab Delimited (TSV)   2D SDfile   Computed 3D by Vconf -m prep SDfile
Find this compound or compounds like it in BindingDB:
Activity Spreadsheet -- Enzyme Inhibition Constant Data from BindingDB
Found 2 hits for monomerid = 50346686
TargetGlycogen phosphorylase, muscle form(Oryctolagus cuniculus (rabbit))
Chinese Academy Of Sciences
Curated by ChEMBL
LigandPNGBDBM50346686(Benzyl 3b-[2-(4-dodecanoyloxymethyl-1H-1,2,3- tria...)
Affinity DataIC50:  7.76E+3nM. Assay description: Inhibition of rabbit muscle glycogen phosphorylase A assessed as release of phosphate from glucose-1-phosphate after 25 mins by microplate reader bas...
In DepthDetails ArticlePubMed
TargetGlycogen phosphorylase, muscle form(Oryctolagus cuniculus (rabbit))
Chinese Academy Of Sciences
Curated by ChEMBL
LigandPNGBDBM50346686(Benzyl 3b-[2-(4-dodecanoyloxymethyl-1H-1,2,3- tria...)
Affinity DataIC50:  7.76E+3nMpH: 7.2 T: 2°C. Assay description: Rabbit muscle glycogen phosphorylase a (RMGPa) activity was measured by the release of phosphate from glucose-1-phosphate at 655 nm. Each compound wa...
In DepthDetails ArticlePubMed