BDBM50346807 CHEMBL1796025
SMILES COc1ccc(CCCc2ccc(O)cc2)cc1
InChI Key InChIKey=QDMJQCMUSFNVCX-UHFFFAOYSA-N
Data  1 IC50
  Tab Delimited (TSV)   2D SDfile   Computed 3D by Vconf -m prep SDfile
Find this compound or compounds like it in BindingDB:
Activity Spreadsheet -- Enzyme Inhibition Constant Data from BindingDB
Found 1 hit for monomerid = 50346807
TargetCalmodulin-1(Human)
Universidad Nacional Aut£Noma De M£Xico
Curated by ChEMBL
LigandPNGBDBM50346807(CHEMBL1796025)
Affinity DataIC50:  6.27E+4nM. Assay description: Inhibition of Calmodulin-dependent PDE1 activity assessed as inorganic phosphate release after 30 min
In DepthDetails ArticlePubMed