BDBM50346812 CHEMBL1796021
SMILES COc1cc(Cc2ccc(O)c(OC)c2)cc(OC)c1
InChI Key InChIKey=NLXCJVVHYQGYMY-UHFFFAOYSA-N
Data  1 IC50
  Tab Delimited (TSV)   2D SDfile   Computed 3D by Vconf -m prep SDfile
Find this compound or compounds like it in BindingDB:
Activity Spreadsheet -- Enzyme Inhibition Constant Data from BindingDB
Found 1 hit for monomerid = 50346812
TargetCalmodulin-1(Human)
Universidad Nacional Aut£Noma De M£Xico
Curated by ChEMBL
LigandPNGBDBM50346812(CHEMBL1796021)
Affinity DataIC50:  5.47E+4nM. Assay description: Inhibition of Calmodulin-dependent PDE1 activity assessed as inorganic phosphate release after 30 min
In DepthDetails ArticlePubMed