BDBM50346913 CHEMBL1795508
SMILES Cc1ccc(COc2cc(O)cc3oc4cc(O)c(O)cc4c(=O)c23)cc1
InChI Key InChIKey=CQGRWDPIIDWFAD-UHFFFAOYSA-N
Data  1 IC50
  Tab Delimited (TSV)   2D SDfile   Computed 3D by Vconf -m prep SDfile
Find this compound or compounds like it in BindingDB:
Activity Spreadsheet -- Enzyme Inhibition Constant Data from BindingDB
Found 1 hit for monomerid = 50346913
TargetXanthine dehydrogenase/oxidase(Bos taurus (Bovine))
Second Military Medical University
Curated by ChEMBL
LigandPNGBDBM50346913(CHEMBL1795508)
Affinity DataIC50:  5.73E+3nM. Assay description: Inhibition of bovine Xanthine oxidase assessed as reduction in uric acid level by spectrophotometry
In DepthDetails ArticlePubMed