BDBM50346972 CHEMBL1795886
SMILES CN1CCC(CC1)NC(=O)c1ccc(cc1)-c1ccc(cc1C)-n1c2c(ccc1=O)cnc1ccc(cc21)-c1cnn(C)c1
InChI Key InChIKey=LHQLXWLOIGQADE-UHFFFAOYSA-N
Data  1 EC50
  Tab Delimited (TSV)   2D SDfile   Computed 3D by Vconf -m prep SDfile
Find this compound or compounds like it in BindingDB:
Activity Spreadsheet -- Enzyme Inhibition Constant Data from BindingDB
Found 1 hit for monomerid = 50346972
TargetSerine/threonine-protein kinase mTOR(Mus musculus (Mouse))
Dana-Farber Cancer Institute
Curated by ChEMBL
LigandPNGBDBM50346972(CHEMBL1795886)
Affinity DataEC50:  150nM. Assay description: Inhibition of mTOR-dependent S6K phosphorylation at T389 residue in MEF cells
In DepthDetails ArticlePubMed