BDBM50347023 CHEMBL1796082
SMILES COCC(=O)N1CCCCN1C(=O)[C@H](CC1CCCC1)CN(O)C=O
InChI Key InChIKey=RLHPTGFDIJMJSD-OAHLLOKOSA-N
Data  1 IC50
  Tab Delimited (TSV)   2D SDfile   Computed 3D by Vconf -m prep SDfile
Find this compound or compounds like it in BindingDB:
Activity Spreadsheet -- Enzyme Inhibition Constant Data from BindingDB
Found 1 hit for monomerid = 50347023
TargetPeptide deformylase(Escherichia coli)
Vernalis (R&D)
Curated by ChEMBL
LigandPNGBDBM50347023(CHEMBL1796082)
Affinity DataIC50:  200nM. Assay description: Inhibition of Escherichia coli nickel containing peptide deformylase
In DepthDetails ArticlePubMed