BDBM50347045 CHEMBL1796227
SMILES ON(C[C@@H](CC1CCCC1)C(=O)N1CCCN1C(=O)Nc1ccc(cc1)C(F)(F)F)C=O
InChI Key InChIKey=AZDBVFBZRIGLEX-MRXNPFEDSA-N
Data  1 IC50
  Tab Delimited (TSV)   2D SDfile   Computed 3D by Vconf -m prep SDfile
Find this compound or compounds like it in BindingDB:
Activity Spreadsheet -- Enzyme Inhibition Constant Data from BindingDB
Found 1 hit for monomerid = 50347045
TargetPeptide deformylase(Escherichia coli)
Vernalis (R&D)
Curated by ChEMBL
LigandPNGBDBM50347045(CHEMBL1796227)
Affinity DataIC50:  30nM. Assay description: Inhibition of Escherichia coli nickel containing peptide deformylase
In DepthDetails ArticlePubMed