BDBM50347152 CHEMBL1797501
SMILES OC(=O)CCNC\C=C\c1ccc(OCCCCc2ccccc2)cc1Cl
InChI Key InChIKey=ZJHORWWLGGSPHB-UXBLZVDNSA-N
Data  2 EC50
  Tab Delimited (TSV)   2D SDfile   Computed 3D by Vconf -m prep SDfile
Find this compound or compounds like it in BindingDB:
Activity Spreadsheet -- Enzyme Inhibition Constant Data from BindingDB
Found 2 hits for monomerid = 50347152
TargetSphingosine 1-phosphate receptor 1(Homo sapiens (Human))
Ono Pharmaceutical
Curated by ChEMBL
LigandPNGBDBM50347152(CHEMBL1797501)
Affinity DataEC50:  24nM. Assay description: Agonist activity at human S1P1 receptor expressed in CHO cells assessed as intracellular calcium levels
In DepthDetails ArticlePubMed
TargetSphingosine 1-phosphate receptor 3(Homo sapiens (Human))
Ono Pharmaceutical
Curated by ChEMBL
LigandPNGBDBM50347152(CHEMBL1797501)
Affinity DataEC50:  7.20E+3nM. Assay description: Agonist activity at human S1P3 receptor expressed in CHO cells assessed as intracellular calcium levels
In DepthDetails ArticlePubMed