BDBM50347154 CHEMBL1797503
SMILES Cc1cc(OCCCCc2ccccc2)ccc1\C=C\CNCCC(O)=O
InChI Key InChIKey=GAUBCPICJGRPMP-YRNVUSSQSA-N
Data  2 EC50
  Tab Delimited (TSV)   2D SDfile   Computed 3D by Vconf -m prep SDfile
Find this compound or compounds like it in BindingDB:
Activity Spreadsheet -- Enzyme Inhibition Constant Data from BindingDB
Found 2 hits for monomerid = 50347154
TargetSphingosine 1-phosphate receptor 1(Homo sapiens (Human))
Ono Pharmaceutical
Curated by ChEMBL
LigandPNGBDBM50347154(CHEMBL1797503)
Affinity DataEC50:  36nM. Assay description: Agonist activity at human S1P1 receptor expressed in CHO cells assessed as intracellular calcium levels
In DepthDetails ArticlePubMed
TargetSphingosine 1-phosphate receptor 3(Homo sapiens (Human))
Ono Pharmaceutical
Curated by ChEMBL
LigandPNGBDBM50347154(CHEMBL1797503)
Affinity DataEC50: >1.00E+4nM. Assay description: Agonist activity at human S1P3 receptor expressed in CHO cells assessed as intracellular calcium levels
In DepthDetails ArticlePubMed