BDBM50347282 CHEMBL1796130
SMILES CN(CCCNC(=O)c1ccc2c(c1)N(Cc1ccc(C)cc1C)C(=O)c1ccccc1S2=O)C1CCCCC1
InChI Key InChIKey=ZJRYVYSMLLTUKI-UHFFFAOYSA-N
Data  1 IC50
  Tab Delimited (TSV)   2D SDfile   Computed 3D by Vconf -m prep SDfile
Find this compound or compounds like it in BindingDB:
Activity Spreadsheet -- Enzyme Inhibition Constant Data from BindingDB
Found 1 hit for monomerid = 50347282
TargetL-cysteine:1D-myo-inositol 2-amino-2-deoxy-alpha-D-glucopyranoside ligase(Mycobacterium tuberculosis)
University Of California
Curated by ChEMBL
LigandPNGBDBM50347282(CHEMBL1796130)
Affinity DataIC50:  2.00E+6nM. Assay description: Inhibition of Mycobacterium tuberculosis recombinant MshC assessed as production of Cys-GlcN-Ins from cysteine by HPLC based fluorescence assay
In DepthDetails ArticlePubMed