BDBM50347299 CHEMBL1796454
SMILES Cc1ccc(cc1)C1CC(=NN1C(N)=O)c1ccccc1
InChI Key InChIKey=YULVRNZIINHBGI-UHFFFAOYSA-N
Data  2 KI
  Tab Delimited (TSV)   2D SDfile   Computed 3D by Vconf -m prep SDfile
Find this compound or compounds like it in BindingDB:
Activity Spreadsheet -- Enzyme Inhibition Constant Data from BindingDB
Found 2 hits for monomerid = 50347299
TargetAmine oxidase [flavin-containing] A(Homo sapiens (Human))
Birla Institute Of Technology
Curated by ChEMBL
LigandPNGBDBM50347299(CHEMBL1796454)
Affinity DataKi:  490nM. Assay description: Inhibition of human MAO-A expressed in BTI insect cells using p-tyramine as substrate after 60 mins
In DepthDetails ArticlePubMed
TargetAmine oxidase [flavin-containing] B(Homo sapiens (Human))
Birla Institute Of Technology
Curated by ChEMBL
LigandPNGBDBM50347299(CHEMBL1796454)
Affinity DataKi:  3.20E+3nM. Assay description: Inhibition of human MAO-B expressed in BTI insect cells using p-tyramine as substrate after 60 mins
In DepthDetails ArticlePubMed