BDBM50347581 CHEMBL1801655
SMILES OP(O)(=O)Cc1ccc(cn1)-c1ccc(F)cc1
InChI Key InChIKey=PUUKCHGJLPYUGY-UHFFFAOYSA-N
Data  1 KI
  Tab Delimited (TSV)   2D SDfile   Computed 3D by Vconf -m prep SDfile
Find this compound or compounds like it in BindingDB:
Activity Spreadsheet -- Enzyme Inhibition Constant Data from BindingDB
Found 1 hit for monomerid = 50347581
Target1-deoxy-D-xylulose 5-phosphate reductoisomerase(Mycobacterium tuberculosis)
Baylor College Of Medicine
Curated by ChEMBL
LigandPNGBDBM50347581(CHEMBL1801655)
Affinity DataKi:  5.07E+4nM. Assay description: Inhibition of Mycobacterium tuberculosis recombinant DXR expressed in Escherichia coli BL21 (DE3) using DXP as substrate and MgCl2 as cofactor preinc...
In DepthDetails ArticlePubMed