BDBM50347891 CHEMBL1802629
SMILES Cc1[nH]c2ccccc2c1-c1ccnc(Nc2cccnc2)n1
InChI Key InChIKey=GUBLLHZACKGVEX-UHFFFAOYSA-N
Data  1 IC50
  Tab Delimited (TSV)   2D SDfile   Computed 3D by Vconf -m prep SDfile
Find this compound or compounds like it in BindingDB:
Activity Spreadsheet -- Enzyme Inhibition Constant Data from BindingDB
Found 1 hit for monomerid = 50347891
TargetInterferon-induced, double-stranded RNA-activated protein kinase(Homo sapiens (Human))
Weill Cornell Medical College
Curated by ChEMBL
LigandPNGBDBM50347891(CHEMBL1802629)
Affinity DataIC50:  100nM. Assay description: Inhibition of human recombinant PKR autophosphorylation using poly[I:C] after 10 mins by luminescent assay
In DepthDetails ArticlePubMed