BDBM50348084 CHEMBL1800714
SMILES COc1cccc(NCC[C@@]2(CCOC(C)(C)C2)c2ccccc2)c1
InChI Key InChIKey=DMMQLOOWARMXLU-QFIPXVFZSA-N
Data  1 IC50
  Tab Delimited (TSV)   2D SDfile   Computed 3D by Vconf -m prep SDfile
Find this compound or compounds like it in BindingDB:
Activity Spreadsheet -- Enzyme Inhibition Constant Data from BindingDB
Found 1 hit for monomerid = 50348084
TargetProtein-S-isoprenylcysteine O-methyltransferase(Homo sapiens (Human))
Myrexis
Curated by ChEMBL
LigandPNGBDBM50348084(CHEMBL1800714)
Affinity DataIC50:  230nM. Assay description: Inhibition of human recombinant C-terminal His6-tagged ICMT assessed as methylation of N-acetyl-S-geranylgeranylcysteine using SAM as methyl donor su...
In DepthDetails ArticlePubMed