BDBM50348230 CHEMBL1800810
SMILES COc1cc(F)c(cc1-c1ccc(cc1CN1C(=O)O[C@H](c2cc(cc(c2)C(F)(F)F)C(F)(F)F)C1(C)C)C(F)(F)F)C(C)C
InChI Key InChIKey=DCGKVWUPMGGBHY-AREMUKBSSA-N
Data  1 IC50
  Tab Delimited (TSV)   2D SDfile   Computed 3D by Vconf -m prep SDfile
Find this compound or compounds like it in BindingDB:
Activity Spreadsheet -- Enzyme Inhibition Constant Data from BindingDB
Found 1 hit for monomerid = 50348230
TargetCholesteryl ester transfer protein(Homo sapiens (Human))
Merck Research Laboratories
Curated by ChEMBL
LigandPNGBDBM50348230(CHEMBL1800810)
Affinity DataIC50:  17.8nM. Assay description: Inhibition of human recombinant CETP-mediated cholesteryl ester transfer activity after 1 hr by fluorescent cholesteryl esters transfer assay
In DepthDetails ArticlePubMed