BDBM50348775 CHEMBL1807018
SMILES CC(C)(C)[Si](OC[C@H]1O[C@H](C=C1)n1ccc(=O)[nH]c1=O)(c1ccccc1)c1ccccc1
InChI Key InChIKey=IHZUQZWWKIYBME-WMZHIEFXSA-N
Data  1 KI
  Tab Delimited (TSV)   2D SDfile   Computed 3D by Vconf -m prep SDfile
Find this compound or compounds like it in BindingDB:
Activity Spreadsheet -- Enzyme Inhibition Constant Data from BindingDB
Found 1 hit for monomerid = 50348775
TargetDeoxyuridine 5'-triphosphate nucleotidohydrolase, mitochondrial(Homo sapiens (Human))
Instituto De Parasitolog£A Y Biomedicina L£Pez-Neyra
Curated by ChEMBL
LigandPNGBDBM50348775(CHEMBL1807018)
Affinity DataKi: >1.00E+6nM. Assay description: Inhibition of human dUTPase using dUTP as substrate by spectrophotometric analysis
In DepthDetails ArticlePubMed