BDBM50349135 CHEMBL1807518
SMILES CN(C)CCN(C)C(=O)c1ccc2nc([nH]c2c1)-c1[nH]nc2ncc(cc12)-c1cncc2ccccc12
InChI Key InChIKey=NVHDJGILBNYPAZ-UHFFFAOYSA-N
Data  1 IC50
  Tab Delimited (TSV)   2D SDfile   Computed 3D by Vconf -m prep SDfile
Find this compound or compounds like it in BindingDB:
Activity Spreadsheet -- Enzyme Inhibition Constant Data from BindingDB
Found 1 hit for monomerid = 50349135
TargetProto-oncogene tyrosine-protein kinase receptor Ret(Homo sapiens (Human))
National Tsing Hua University
Curated by ChEMBL
LigandPNGBDBM50349135(CHEMBL1807518)
Affinity DataIC50:  1.00E+5nM. Assay description: Inhibition of RET kinase
In DepthDetails ArticlePubMed