BDBM50349151 CHEMBL1807724
SMILES CN(C)CCc1ccc(Nc2nccc(n2)-c2c[nH]c3ncccc23)cc1
InChI Key InChIKey=VJNBQLJMZOWUIM-UHFFFAOYSA-N
Data  1 IC50
  Tab Delimited (TSV)   2D SDfile   Computed 3D by Vconf -m prep SDfile
Find this compound or compounds like it in BindingDB:
Activity Spreadsheet -- Enzyme Inhibition Constant Data from BindingDB
Found 1 hit for monomerid = 50349151
TargetProto-oncogene tyrosine-protein kinase receptor Ret(Homo sapiens (Human))
National Tsing Hua University
Curated by ChEMBL
LigandPNGBDBM50349151(CHEMBL1807724)
Affinity DataIC50:  537nM. Assay description: Inhibition of RET kinase
In DepthDetails ArticlePubMed