BDBM50349304 CHEMBL1808273
SMILES Oc1c2CN(CC3CCCCC3)CCn2c(=O)n1[C@H]1C[C@@H]1c1ccccc1
InChI Key InChIKey=GALAGQJETCEXBC-MOPGFXCFSA-N
Data  1 IC50
  Tab Delimited (TSV)   2D SDfile   Computed 3D by Vconf -m prep SDfile
Find this compound or compounds like it in BindingDB:
Activity Spreadsheet -- Enzyme Inhibition Constant Data from BindingDB
Found 1 hit for monomerid = 50349304
TargetSmoothened homolog(Homo sapiens (Human))
Merck Research Laboratories
Curated by ChEMBL
LigandPNGBDBM50349304(CHEMBL1808273)
Affinity DataIC50: >2.50E+3nM. Assay description: Displacement of [125I]-PA cyclopamine from smoothened expressed in african green monkey COS-1 cells after 10 mins by autoradiography
In DepthDetails ArticlePubMed