BDBM50349389 CHEMBL1808514
SMILES COC(=O)c1nn(C(=O)c2cccc(C)c2)c2ccccc12
InChI Key InChIKey=JZSOCPVJALRMLO-UHFFFAOYSA-N
Data  3 IC50
  Tab Delimited (TSV)   2D SDfile   Computed 3D by Vconf -m prep SDfile
Find this compound or compounds like it in BindingDB:
Activity Spreadsheet -- Enzyme Inhibition Constant Data from BindingDB
Found 3 hits for monomerid = 50349389
TargetProthrombin(Homo sapiens (Human))
Universit£
Curated by ChEMBL
LigandPNGBDBM50349389(CHEMBL1808514)
Affinity DataIC50:  5.10E+3nM. Assay description: Inhibition of human plasma thrombin benzoyl-Phe-Val-Arg-7-amino-4-methylcoumarin as substrate by spectrophotometric analysis
In DepthDetails ArticlePubMed
TargetNeutrophil elastase(Homo sapiens (Human))
Universit£
Curated by ChEMBL
LigandPNGBDBM50349389(CHEMBL1808514)
Affinity DataIC50:  130nM. Assay description: Inhibition of human neutrophil elastase using N-methylsuccinyl-Ala-Ala-Pro-Val-7-amino-4-methyl-coumarin as substrate measured every 30 secs for 10 m...
In DepthDetails ArticlePubMed
TargetUrokinase-type plasminogen activator(Homo sapiens (Human))
Universit£
Curated by ChEMBL
LigandPNGBDBM50349389(CHEMBL1808514)
Affinity DataIC50:  870nM. Assay description: Inhibition of human urine urokinase using benzyloxycarbonyl-Gly-Gly-Arg-7-amino-4-methylcoumarin as substrate by spectrophotometric analysis
In DepthDetails ArticlePubMed