BDBM50349424 CHEMBL1808524
SMILES CC(C)OC(=O)c1nn(C(=O)c2cccc(C)c2)c2ccccc12
InChI Key InChIKey=MOXFASJZIQASHF-UHFFFAOYSA-N
Data  1 IC50
  Tab Delimited (TSV)   2D SDfile   Computed 3D by Vconf -m prep SDfile
Find this compound or compounds like it in BindingDB:
Activity Spreadsheet -- Enzyme Inhibition Constant Data from BindingDB
Found 1 hit for monomerid = 50349424
TargetNeutrophil elastase(Homo sapiens (Human))
Universit£
Curated by ChEMBL
LigandPNGBDBM50349424(CHEMBL1808524)
Affinity DataIC50:  650nM. Assay description: Inhibition of human neutrophil elastase using N-methylsuccinyl-Ala-Ala-Pro-Val-7-amino-4-methyl-coumarin as substrate measured every 30 secs for 10 m...
In DepthDetails ArticlePubMed