BDBM50349497 CHEMBL1808637
SMILES Cc1ccccc1S(=O)(=O)N1Cc2ccc(\C=C\C(=O)NO)cc2C1
InChI Key InChIKey=OBRYEOWKEAMGII-VQHVLOKHSA-N
Data  2 IC50
  Tab Delimited (TSV)   2D SDfile   Computed 3D by Vconf -m prep SDfile
Find this compound or compounds like it in BindingDB:
Activity Spreadsheet -- Enzyme Inhibition Constant Data from BindingDB
Found 2 hits for monomerid = 50349497
TargetPotassium voltage-gated channel subfamily H member 2(Homo sapiens (Human))
Novartis Institutes For Biomedical Research
Curated by ChEMBL
LigandPNGBDBM50349497(CHEMBL1808637)
Affinity DataIC50: >3.00E+4nM. Assay description: Inhibition of human ERG by automated patch clamp assay
In DepthDetails ArticlePubMed
TargetHistone deacetylase 1(Homo sapiens (Human))
Novartis Institutes For Biomedical Research
Curated by ChEMBL
LigandPNGBDBM50349497(CHEMBL1808637)
Affinity DataIC50:  130nM. Assay description: Inhibition of purified recombinant HDAC1
In DepthDetails ArticlePubMed