BDBM50349545 CHEMBL1808900
SMILES Cc1cc(ncc1C1CC(F)CN1C(=O)C1CCC1)-c1cccc(Cl)c1
InChI Key InChIKey=BPICUEHAJGKYLS-UHFFFAOYSA-N
Data  1 KI  1 IC50
  Tab Delimited (TSV)   2D SDfile   Computed 3D by Vconf -m prep SDfile
Find this compound or compounds like it in BindingDB:
Activity Spreadsheet -- Enzyme Inhibition Constant Data from BindingDB
Found 2 hits for monomerid = 50349545
TargetMetabotropic glutamate receptor 5(Homo sapiens (Human))
Lundbeck Research Usa
Curated by ChEMBL
LigandPNGBDBM50349545(CHEMBL1808900)
Affinity DataKi:  130nM. Assay description: Displacement of [3H]-MPEP from human mGluR5 expressed in CHO cells after 60 mins
In DepthDetails ArticlePubMed
TargetMetabotropic glutamate receptor 5(Homo sapiens (Human))
Lundbeck Research Usa
Curated by ChEMBL
LigandPNGBDBM50349545(CHEMBL1808900)
Affinity DataIC50:  140nM. Assay description: Negative allosteric modulation of human mGlu5 receptor expressed in HEK293 cells assessed as inhibition of glutamate-induced calcium mobilization aft...
In DepthDetails ArticlePubMed