BDBM50349636 CHEMBL1808994
SMILES NC(=O)[C@H]1CN([C@@H]2Cc3c[nH]c4cccc(C2=C1)c34)C(=O)Nc1ccccc1
InChI Key InChIKey=UNHPFFHUMWFKAQ-AUUYWEPGSA-N
Data  1 IC50
  Tab Delimited (TSV)   2D SDfile   Computed 3D by Vconf -m prep SDfile
Find this compound or compounds like it in BindingDB:
Activity Spreadsheet -- Enzyme Inhibition Constant Data from BindingDB
Found 1 hit for monomerid = 50349636
TargetC-X-C chemokine receptor type 3(Homo sapiens (Human))
Novartis Institutes For Biomedical Research
Curated by ChEMBL
LigandPNGBDBM50349636(CHEMBL1808994)
Affinity DataIC50: >1.00E+4nM. Assay description: Displacement of radiolabeled CXCL11 from human CXCR3 expressed in CHO cells by scintillation proximity assay
In DepthDetails ArticlePubMed