BDBM50349717 CHEMBL1809060
SMILES COc1cc(ccc1Nc1ncc(Cl)c(n1)-c1cnc2ccccn12)N1CC2COCC(C1)N2
InChI Key InChIKey=LYHJDICGPZUYSN-UHFFFAOYSA-N
Data  3 IC50
  Tab Delimited (TSV)   2D SDfile   Computed 3D by Vconf -m prep SDfile
Find this compound or compounds like it in BindingDB:
Activity Spreadsheet -- Enzyme Inhibition Constant Data from BindingDB
Found 3 hits for monomerid = 50349717
TargetInsulin-like growth factor 1 receptor(Homo sapiens (Human))
Astrazeneca
Curated by ChEMBL
LigandPNGBDBM50349717(CHEMBL1809060)
Affinity DataIC50:  45nM. Assay description: Inhibition of auto-phosphorylation of IGFR1
In DepthDetails ArticlePubMed
TargetPotassium voltage-gated channel subfamily H member 2(Homo sapiens (Human))
Astrazeneca
Curated by ChEMBL
LigandPNGBDBM50349717(CHEMBL1809060)
Affinity DataIC50:  1.00E+4nM. Assay description: Inhibition of human ERG by electrophysiology assay
In DepthDetails ArticlePubMed
TargetInsulin-like growth factor 1 receptor(Homo sapiens (Human))
Astrazeneca
Curated by ChEMBL
LigandPNGBDBM50349717(CHEMBL1809060)
Affinity DataIC50:  82nM. Assay description: Inhibition of auto-phosphorylation of IGFR1 by cell based assay
In DepthDetails ArticlePubMed