BDBM50349957 CHEMBL1812292
SMILES COc1ccccc1N1CCN(CCn2cnc3c4ccc(C)cc4ncc3c2=O)CC1
InChI Key InChIKey=YWUAYMAGUKRJCN-UHFFFAOYSA-N
Data  1 KI
  Tab Delimited (TSV)   2D SDfile   Computed 3D by Vconf -m prep SDfile
Find this compound or compounds like it in BindingDB:
Activity Spreadsheet -- Enzyme Inhibition Constant Data from BindingDB
Found 1 hit for monomerid = 50349957
Target5-hydroxytryptamine receptor 1A(Rattus norvegicus (rat))
Medical University Of Lodz
Curated by ChEMBL
LigandPNGBDBM50349957(CHEMBL1812292)
Affinity DataKi:  14nM. Assay description: Displacement of [3H]8-OH-DPAT from 5HT1A receptor in rat hippocampal membrane by radioligand binding assay
In DepthDetails ArticlePubMed