BDBM50349992 CHEMBL1813047
SMILES COc1ccc(COC2CCN(CC2)c2ncnc(Nc3cccc(NC(C)=O)c3C)n2)cc1
InChI Key InChIKey=VFZIAHIGUJIRIA-UHFFFAOYSA-N
Data  1 IC50
  Tab Delimited (TSV)   2D SDfile   Computed 3D by Vconf -m prep SDfile
Find this compound or compounds like it in BindingDB:
Activity Spreadsheet -- Enzyme Inhibition Constant Data from BindingDB
Found 1 hit for monomerid = 50349992
TargetSodium channel protein type 9 subunit alpha(Homo sapiens (Human))
Amgen
Curated by ChEMBL
LigandPNGBDBM50349992(CHEMBL1813047)
Affinity DataIC50: >1.00E+4nM. Assay description: Inhibition of human sodium channel Nav1.7 expressed in human HEK293 cells by patch-clamp electrophysiological assay
In DepthDetails ArticlePubMed