BDBM50350364 CHEMBL1813286
SMILES CN1C(COc2ccc(C(=O)n3c(C)c(CC(O)=O)c4ccccc34)c(C)c2)Cc2ccccc12
InChI Key InChIKey=OMSPXIRBZDJEKN-UHFFFAOYSA-N
Data  1 KI  1 IC50
  Tab Delimited (TSV)   2D SDfile   Computed 3D by Vconf -m prep SDfile
Find this compound or compounds like it in BindingDB:
Activity Spreadsheet -- Enzyme Inhibition Constant Data from BindingDB
Found 2 hits for monomerid = 50350364
TargetProstacyclin receptor(Homo sapiens (Human))
Minase Research Institute
Curated by ChEMBL
LigandPNGBDBM50350364(CHEMBL1813286)
Affinity DataKi: >1.00E+4nM. Assay description: Displacement of [3H]-Iloprost from human IP receptor expressed in CHO cells after 30 mins by liquid scintillation counting
In DepthDetails ArticlePubMed
TargetProstaglandin D2 receptor(Mus musculus)
Minase Research Institute
Curated by ChEMBL
LigandPNGBDBM50350364(CHEMBL1813286)
Affinity DataIC50:  6.20nM. Assay description: Antagonist activity at mouse DP receptor expressed in CHO cells assessed as inhibition of PGD2-induced cAMP accumulation after 10 mins by enzyme immu...
In DepthDetails ArticlePubMed